�s���{���R�[�h���͎s�撬���R�[�h,NO,�s���{����,�s�撬����,�C�x���g��,�C�x���g��_�J�i,�C�x���g��_�p��,�J�n��,�I����,�J�n����,�I������,�J�n�������L����,����,����(��{),����(�ڍ�),�A���於��,�A����d�b�ԍ�,�A��������ԍ�,��Î�,�ꏊ����,�Z��,����,�ܓx,�o�x,�A�N�Z�X���@,���ԏ���,���,�Q���\���I����,�Q���\���I������,�Q���\�����@,URL,���l
131199,,�����s,����,�u�����}�C�E�^�C�����C���v�u�K,�u�g�E�L���E�}�C�E�^�C�����C���v�R�E�V���E,,2021/7/17,2021/7/17,9:30,11:30,,�}�C�E�^�C�����C���V�[�g�̍쐬���@��A���ɕK�v�ȏ��ɂ��ĉ�����܂��B��u�҂ɂ͉��Łu�����E�}�C�^�C�����C���v�ƃn�U�[�h�}�b�v��z�z���܂��B,,,,,,,��������{���� ���4�K �ЊQ�΍�,,,,,,,,2021/6/21,,,/1000779/1000796/1000798/1033243.html,
131199,,�����s,����,�u�����}�C�E�^�C�����C���v�u�K,�u�g�E�L���E�}�C�E�^�C�����C���v�R�E�V���E,,2021/7/18,2021/7/18,9:30,11:30,,�}�C�E�^�C�����C���V�[�g�̍쐬���@��A���ɕK�v�ȏ��ɂ��ĉ�����܂��B��u�҂ɂ͉��Łu�����E�}�C�^�C�����C���v�ƃn�U�[�h�}�b�v��z�z���܂��B,,,,,,,�@���n��Z���^�[���N���G�[�V�����z�[��,,,,,,,,2021/6/21,,,/1000779/1000796/1000798/1033243.html,
131199,,�����s,����,�����΂��V�F�C�N�A�E�g(1���Ԗh�ЌP��),�C�^�o�V�V�F�C�N�A�E�g(1�t���J���{�E�T�C�N������),,2021/3/11,2021/3/11,11:00,11:05,,,,,,,,,�P�����ɂ���ꏊ,,,,,,,,,,,/1000779/1000796/1000798/1031503.html,
131199,,�����s,����,�������N�Z�~�i�[�F�u�咰�|���[�v��咰����ƌ���ꂽ��A�ǂ�����H�ǂ��Ȃ�H�v,�W���Z�C�P���R�E�Z�~�i�[�F�u�_�C�`���E�|���[�v���_�C�`���E�K���g�C�����^���A�h�E�X���H�h�E�i���H�v,,2021/11/26,2021/11/26,14:00,16:00,,�u�`,,,,,,,����O���[���z�[��6�K�@601��c��,,,,,,,,,,,/1000779/1000809/1000814/1036267.html,
131199,,�����s,����,�ߘa3�N�x�@���ȍu����,���C����3�l���h�@�V�J�R�E�G���J�C,,2021/11/1,2021/11/30,,,,,,,,,,,,,,,,,,,,,,/1000779/1000809/1000814/1034916.html,
131199,,�����s,����,�͂��߂Ă̎��݂����Ђ�΁i�����N�����Z���^�[�j,�n�W���e�m�n�~�K�L�q���o�i�C�^�o�V�P���R�E�t�N�V�Z���^�[�j,,2021/11/17,2021/11/17,10:20,11:30,,"�q�ǂ��̎��݂������k�i�����̂ނ����\�h�Ǝ����j�A�ی�ґΏۂ̎��ȑ��k	�������@��q���N�蒠	����@16�g�i�\�����j",,,,,,,�����N�����Z���^�[,,,,,,,,,,,/1000779/1000809/1000817/1033519.html,
131199,,�����s,����,�����H����c���H�ւ̂����ߕ��i������N�����Z���^�[�j�ߑO�̕�,���j���E�V���N�J�����E�W�V���N�w�m�X�X���J�^�i�J�~�C�^�o�V�P���R�E�t�N�V�Z���^�[�j�S�[���m�u,,2021/12/15,2021/12/15,10:00,10:45,,"9��������1��6�����̂��q����̕ی�҂̕���ΏۂɁA�����H�㔼����c���H�ւ̂����ߕ��ɂ��āA�u�`�Ɨ����Љ�E�W���̍u�K����J�Â��܂��B&nbsp;	9�������痣�����������̐H�ނ̌`�ԁA�傫���A�����Ȃ�	��l�ƈꏏ�ɐH�ׂ闣���H	��Â��ݐH��		&nbsp;&nbsp;",,,,,,,������N�����Z���^�[,,,,,,,,,,,/1000779/1000809/1000818/1036310.html,
131199,,�����s,����,�����H����c���H�ւ̂����ߕ��i������N�����Z���^�[�j�ߌ�̕�,���j���E�V���N�J�����E�W�V���N�w�m�X�X���J�^�i�J�~�C�^�o�V�P���R�E�t�N�V�Z���^�[�j�S�S�m�u,,2021/12/15,2021/12/15,14:00,14:45,,"9��������1��6�����̂��q����̕ی�҂̕���ΏۂɁA�����H�㔼����c���H�ւ̂����ߕ��ɂ��āA�u�`�Ɨ����Љ�E�W���̍u�K����J�Â��܂��B&nbsp;	9�������痣�����������̐H�ނ̌`�ԁA�傫���A�����Ȃ�	��l�ƈꏏ�ɐH�ׂ闣���H	��Â��ݐH��		&nbsp;&nbsp;",,,,,,,������N�����Z���^�[,,,,,,,,,,,/1000779/1000809/1000818/1036310.html,
131199,,�����s,����,�����H����c���H�ւ̂����ߕ��i�u�����N�����Z���^�[�j�ߑO�̕�,���j���E�V���N�J�����E�W�V���N�w�m�X�X���J�^�i�V�����P���R�E�t�N�V�Z���^�[�j�S�[���m�u,,2021/11/30,2021/11/30,10:00,10:45,,"9��������1��6�����̂��q����̕ی�҂̕��ɁA�����H�㔼����c���H�ւ̂����ߕ��ɂ��āA�u�`�Ɨ����Љ�A�����W���̍u�K����J�Â��܂��B	9�������痣������������̐H�ނ̌`�ԁA�傫���A�����Ȃ�	��l�ƈꏏ�ɐH�ׂ闣���H	��Â��ݐH��",,,,,,,�u�����N�����Z���^�[�i�@��2-5-5�j,,,,,,,,,,,/1000779/1000809/1000820/1035419.html,
131199,,�����s,����,�����H����c���H�ւ̂����ߕ��i�u�����N�����Z���^�[�j�ߌ�̕�,���j���E�V���N�J�����E�W�V���N�w�m�X�X���J�^�i�V�����P���R�E�t�N�V�Z���^�[�j�S�S�m�u,,2021/11/30,2021/11/30,14:00,14:45,,"9��������1��6�����̂��q����̕ی�҂̕��ɁA�����H�㔼����c���H�ւ̂����ߕ��ɂ��āA�u�`�Ɨ����Љ�A�����W���̍u�K����J�Â��܂��B	9�������痣������������̐H�ނ̌`�ԁA�傫���A�����Ȃ�	��l�ƈꏏ�ɐH�ׂ闣���H	��Â��ݐH��",,,,,,,�u�����N�����Z���^�[�i�@��2-5-5�j,,,,,,,,,,,/1000779/1000809/1000820/1035419.html,
131199,,�����s,����,�͂��߂Ă̎��݂����Ђ��,�n�W���e�m�n�~�K�L�q���o,,2021/12/8,2021/12/8,10:30,11:40,,�q�ǂ��̎��݂������k�E�ی�҂̎��ȑ��k,,,,,,,���������N�����Z���^�[,,,,,,,,2021/12/7,,,/1000779/1000809/1000821/1022617.html,
131199,,�����s,����,���拏�Z�x���Z�~�i�[,�C�^�o�V�N�L���W���E�V�G���Z�~�i�[,,2021/11/26,2021/11/26,10:00,11:50,,"��ꕔ�u���F�u����҂̋��Z�x���v�Ƃ́`�s���A���Ԏx���c�̂ɉ������҂ł��邩�u�t�F���m��w���C�t�f�U�C���w�������x���w�ȋ����@�R�{ �����@����񕔃p�l���f�B�X�J�b�V�����F�u����҂̋��Z�x����i�߂邽�߂̕��@�v�R�[�f�B�l�[�^�[�F���m��w���C�t�f�U�C���w�������x���w�ȋ����@�R�{ �����@���p�l���X�g�F�z�[���l�b�g������Ћ��Z�x���A�g���ے��@��c ���@�����M����������Б�\������@�R�� �v�@��	�V�^�R���i�E�C���X�����Ǌg��h�~�ɓw�߂܂�	�}�X�N�̒��p�A�̉��v���ɂ����͂�������",,,,,,,�旧�O���[���z�[��1�K�z�[��,,,,,,,,2021/11/25,,,/1000779/1000906/1000910/1035466.html,
131199,,�����s,����,�D������邨����,�X�L���J�^���I�`���J�C,,2021/9/18,2021/9/18,15:00,17:00,,�Ȃ�ƂȂ��F�B�ɘb���Â炢���ƁA�e�ɂ͌����Ȃ����ƁA������ƋC�ɂȂ邾���̂��Ɓc�c������ׂ肵�Ă݂܂��񂩁H����̃e�[�}�́u�����̍D���ȂƂ����b����!�v�u�D���v����邨����́A���S���āu�D���v�������ł��B���Ȃ��́u�D���v�ɂ��Č���Ă݂܂��񂩁H�����Ă��邾���ł�OK�I���Ђ��Q�����������B,,,,,,,�܂Ȃہ[�Ɛ���,,,,,,,,2021/9/18,,,/1000779/1000922/1000927/1033577.html,
131199,,�����s,����,�n��ɋ����Љ������V���|�W�E���t�H�[�����J�Â̂��m�点,�`�C�L�j�L���E�Z�C�V���J�C���c�N���V���|�W�E���t�H�[�����J�C�T�C�m�I�V���Z,,2021/3/28,2021/3/28,13:00,16:30,,�@�n�����g���ɂ���K�͐X�щ΍ЁE�ُ�C�ہE���ʏ㏸�ȂǁA��̉ۑ肪�l�X�ȂƂ���֊ւ���Ă��܂��B�������甭����H�����ւ̉e���E���N�ւ̉e���E���Ԍn�̕ω��E�h�Ђ̂�����Ȃǐg�߂Ȗ�肩�疢���ɂ��āA�������̐g�߂Ȑ�������A�ꏏ�Ɋw�сA�l���Ă݂܂��񂩁B�@�ԑg�̒��ł́u2020�N�ɐ��E�ŏĂ����X�іʐρv�u���ʂ�1���[�g���㏸����Ɠ��{�͂ǂ��Ȃ�B�v�u���{�ŐH�ׂ��Ȃ��Ȃ�H�ނ́H�v�u2019�N�ɃO���[�������h�ŗn�����X�𓌋�23��ɒ����Ɓc�B�v�ȂǍl���������铊������������܂��B�@������̍r��̔×����A�r�여��̔×��ɂȂ���A�r�여��̔×������E�ɂȂ����Ă��邱�Ƃ�������܂��B���āA������h�Ђ���A�U�߂�h�Ђɕς��Ă݂܂��񂩁B�@����ɂ���āA�N�����c���Ȃ��܂��������Ă����܂��傤�B,,,,,,,�܂Ȃہ[�Ɛ����@�z�[��,,,,,,,,2021/3/28,,,/1000779/1000922/1000927/1031686.html,
131199,,�����s,����,�y���~�z�����΂��{�����e�B�A�E�s�������t�H�[����,�y�`���E�V�z�C�^�o�V�{�����e�B�A�E�V�~���J�c�h�E�t�H�[����,,2020/4/18,2020/4/18,17:30,19:30,,�n��ɕ�炷�l�X�ȋ���A�����I�w�i�A���x�̈Ⴂ�������āA���݂ɗ������������Ƃ��瑽���������Љ�̎����ւ̑������n�܂�B�����ŁA�g�߂Ȓn��ɏZ�ރA�t���J�̗��w���Ƃ̌𗬂ɂ��A�u�ǂ��E�܂ȂԁE�ނ��сv���n�߂݂܂��񂩁B���F�܂Ȃہ[�Ƒ匴�i�匴���U�w�K�Z���^�[�j���N���[�V�����z�[���u�t�F�鋞��w��w�@���O�q���w�����ȋ��� �R�{�G��SDGs�l�b�g���[�N�����΂���\ �����ד����c���@�l�{�����e�B�A�E�s�������w�K���i�Z���^�[������ �A���J�Y�q�ΏہF�ǂȂ��ł�����F60��,,,,,,,,,,,,,,,,,,/1000779/1000922/1000927/1021892.html,
131199,,�����s,����,�y���~�z�����΂��{�����e�B�A�E�s�������t�H�[����,�y�`���E�V�z�C�^�o�V�{�����e�B�A�E�V�~���J�c�h�E�t�H�[����,,2020/4/19,2020/4/19,9:00,10:00,,�n��ɕ�炷�l�X�ȋ���A�����I�w�i�A���x�̈Ⴂ�������āA���݂ɗ������������Ƃ��瑽���������Љ�̎����ւ̑������n�܂�B�����ŁA�g�߂Ȓn��ɏZ�ރA�t���J�̗��w���Ƃ̌𗬂ɂ��A�u�ǂ��E�܂ȂԁE�ނ��сv���n�߂݂܂��񂩁B���F�܂Ȃہ[�Ƒ匴�i�匴���U�w�K�Z���^�[�j���N���[�V�����z�[���u�t�F�鋞��w��w�@���O�q���w�����ȋ��� �R�{�G��SDGs�l�b�g���[�N�����΂���\ �����ד����c���@�l�{�����e�B�A�E�s�������w�K���i�Z���^�[������ �A���J�Y�q�ΏہF�ǂȂ��ł�����F60��,,,,,,,,,,,,,,,,,,/1000779/1000922/1000927/1021892.html,
131199,,�����s,����,�u�����I�Ȋw�K�̎��ԁv�Ɋւ��Ⴊ���҂̎Љ�Q�����l����,�u�\�E�S�E�e�L�i�K�N�V���E�m�W�J���v�j�J�J�����T���K�C�V���m�V���J�C�T���J���J���K�G��,,2020/7/5,2020/7/5,13:30,16:00,,"	��u���@�Љ����w�Z�ȂǂɌq����Ӌ`�ɂ���	���ᔭ�\�@�u�����I�Ȋw�K�̎��ԁv�ɎQ���������̊w��	�ӌ�����	���@�]	�@( �u�t �n����w���_���� �ؑS �͕v �� �j",,,,,,,�匴���U�w�K�Z���^�[�@3�K�@�܂Ȃہ[�ƃz�[��,,,,,,,,,,,/1000779/1000922/1000927/1023253.html,
131199,,�����s,����,�H��u�K��@�q�ǂ������ւ̐H����s���ɂ������l�ɒm���Ăق�������,�V���N�C�N�R�E�V���E�J�C�@�R�h���^�`�w�m�V���N�C�N���I�R�i�E�j�A�^���I�g�i�j�V�b�e�z�V�C�R�g,,2021/11/27,2021/11/27,10:00,12:00,,�u�q�ǂ������ւ̐H����s���ɂ������l�ɒm���Ăق������Ɓv���e�[�}�ɁA�q�ǂ��ɂƂ��ĐS�n�̗ǂ��H���ɂ��Ă�A�H�琄�i�v��ɂ��ĂȂǁA�킩��₷�����b�����������܂��B�����H��Ɍg����Ă�����A�H��Ɋ֐S�̂�����A���񂲎Q�������҂����Ă���܂��B&nbsp;,,,,,,,ZOOM�ɂ��I�����C���u�K��,,,,,,,,2021/11/12,,,/kenko/shokuiku/shokuiku/1034943.html,
131199,,�����s,����,�ߘa3�N�x��3�񌤏C��u�G�l���M�[���p�̊ϓ_�ɂ����钆����Ƃ��Ή����ׂ��J�[�{���j���[�g�����v,�����E��3�l���h�_�C3�J�C�P���V���E�J�C�u�G�l���M�[�����E�m�J���e���j�I�P���`���E�V���E�L�M���E�K�^�C�I�E�X�x�L�J�[�{���j���[�g�����v,,2021/12/15,2021/12/15,14:00,16:00,,����A�J�[�{���j���[�g�����ɑΉ����Ă����ɂ������ĕK�v�ƂȂ�A�E�Y�f�ɌW��g�g�݂␭��̑S�̑��A���B�G�l���M�[���ăG�l������ۂ̒�����Ƒ��̃����b�g�E�Ӌ`�Ȃǂɂ��ĉ�����܂��B,,,,,,,���Y�A��� 3�K��c���i���h54-10�j,,,,,,,,2021/12/10,,,/bousai/kankyo/ondanka/kenshu/1036357.html,
131199,,�����s,����,�ߘa3�N�x��2�񌤏C���SDGs��b�Z�~�i�[��,�����E��3�l���h�_�C2�J�C�P���V���E�J�C��SDGs�L�\�Z�~�i�[��,,2021/10/8,2021/10/8,14:00,16:00,,SDGs�̊�b����A���ƂƂ̂������܂ŁA���߂Ď��g�܂��������ɁA�ŐV�������g������܂����ĉ�����܂��B,,,,,,,���Y�A��� 3�K��c���i���h54-10�j,,,,,,,,2021/10/4,,,/bousai/kankyo/ondanka/kenshu/1035095.html,
131199,,�����s,����,�ߘa3�N�x��1�񌤏C���G�l���M�[������߂���ŋ߂̓����ƍ���̕�������,�����E��3�l���h�_�C1�J�C�P���V���E�J�C��G�l���M�[�Z�C�T�N�����O���T�C�L���m�h�E�R�E�g�R���S�m�z�E�R�E�Z�C��,,2021/6/18,2021/6/18,14:00,16:00,,2050�N�J�[�{���j���[�g�����̎����Ɍ����āA2030�N�܂łɉ������ʃK�X��46���팸�i2013�N�x��j������Ɣ��\������܂����B���ꂩ��啝�ȉ������ʃK�X�팸�����߂���G�l���M�[����ɁA���Ə��͂ǂ��Ή����Ă����ׂ����Ȃǂɂ��āA������܂��B,,,,,,,���Y�A��� 3�K��c���i���h54-10�j,,,,,,,,2021/6/15,,,/bousai/kankyo/ondanka/kenshu/1032783.html,
131199,,�����s,����,�ߘa2�N�x��4�񌤏C��᎖�Ə����m���Ă����ׂ��ߗ׏Z���Ƃ̌��Q���ɂ��ā�,�����E��2�l���h�_�C4�J�C�P���V���E�J�C��W�M���E�V���K�V�b�e�I�N�x�L�L�������W���E�~���g�m�R�E�K�C�����_�C�j�c�C�e��,,2021/3/5,2021/3/5,15:00,17:00,,���Ə����H��Ȃǂ𑀋Ƃ���ɂ�����A�ߗ׏Z���Ƃ̑�����U���A�L�C�Ƃ�����������������i������j���߂ɁA�ߋ��̎��Ⴉ��΍�Ɖ������@�ɂ��ĉ�����܂��B,,,,,,,���Y�A��ف@3�K��c���i���h54-10�j,,,,,,,,2021/2/26,,,/bousai/kankyo/ondanka/kenshu/1031039.html,
131199,,�����s,����,�ߘa2�N�x��3�񌤏C���ȃG�l���M�[�΍�Z�~�i�[��ቻ�w�����ɑ΂���J���ЊQ�h�~�΍�݂̍����,�����E��2�l���h�_�C3�J�C�P���V���E�J�C��V���E�G�l���M�[�^�C�T�N�Z�~�i�[���J�K�N�u�b�V�c�j�^�C�X�����E�h�E�T�C�K�C�{�E�V�^�C�T�N�m�A���J�^��,,2021/1/26,2021/1/26,15:00,17:00,,��1���u�ȃG�l���M�[�΍�Z�~�i�[�v�ē~�Ɏg�p�ʂ�������󒲂�A�V�^�R���i�E�C���X�����Ǘ\�h�Ƃ��Ă̊��C�ɂ��ĂȂǁA�ȃG�l���M�[�΍�����Ƃɉ�����܂���2���u���w�����ɑ΂���J���ЊQ�h�~�΍�݂̍���v���w�����ɂ�����J���҂̌��N��Q�h�~�̕K�v���Ȃǂɂ��ĉ�����܂�,,,,,,,���Y�A��ف@3�K��c���i���h54-10�j,,,,,,,,2021/1/20,,,/bousai/kankyo/ondanka/kenshu/1029228.html,
131199,,�����s,����,�ߘa2�N�x��2�񌤏C��ᒆ����Ƃ�SDGs�Ή��Z�~�i�[��,�����E��2�l���h�_�C2�J�C�P���V���E�J�C��`���E�V���E�L�M���E�mSDGs�^�C�I�E�Z�~�i�[��,,2020/12/10,2020/12/10,15:00,17:00,,SDGs�Ƃ͉����A���̍�SDGs���K�v�Ƃ���邩����{�������������܂��B�܂�������ƂȂǂ�SDGs�̎�g����g�ރ����b�g�Ȃǂ��͂��߁A�ǂ̂悤�ɑΉ����Ă����΂悢��������������܂��B,,,,,,,���Y�A��ف@3�K��c���i���h54-10�j,,,,,,,,,,,/bousai/kankyo/ondanka/kenshu/1028313.html,
131199,,�����s,����,�ߘa2�N�x��1�񌤏C��ᒆ����Ƃ�BCP�΍�Z�~�i�[��,�����E��2�l���h�_�C1�J�C�P���V���E�J�C��`���E�V���E�L�M���E�mBCP�^�C�T�N�Z�~�i�[��,,2020/9/29,2020/9/29,15:00,17:00,,�l�X�Ȏ��R�ЊQ��ً}���̎��ƌp���ɂ��Ăǂ̂悤�ȑ΍���u���Ă����K�v������̂��ABCP�̊�b���������܂��B�܂��A����̐V�^�R���i�E�C���X�����ǂȂǂɑΉ�����BCP����̃|�C���g�ɂ��Ă�������܂��B,,,,,,,���Y�A��ف@3�K��c���i���h54-10�j,,,,,,,,2020/9/25,,,/bousai/kankyo/ondanka/kenshu/1026714.html,
131199,,�����s,����,�ߘa���N�x�i����31�N�x�j��5�񌤏C��ᒆ����Ƃ��s���ׂ��C��ϓ��ւ́w�K���x��,�����E�����g�l���h�i�w�C�Z�C31�l���h�j�_�C5�J�C�P���V���E�J�C��`���E�V���E�L�M���E�K�I�R�i�E�x�L�L�R�E�w���h�E�w�m�w�e�L�I�E�x��,,2020/3/18,2020/3/18,14:00,16:00,,�ߔN�A�ҏ���䕗�⍋�J�Ȃǂ̋C��ϓ��̉e�������������A�C��ϓ��̉e���ɂ���Q��h�~�A�y���������c�邽�߂ɂ͋C��ϓ��ɓK�����邱�Ƃ����߂��Ă��܂��B�����Œ�����Ƃ��ǂ̂悤�ɋC��ϓ��ɓK�����Ă����ׂ����ɂ��Ă��Љ�܂��B,,,,,,,���Y�A��ف@3�K��c���i���h54-10�j,,,,,,,,,,,/bousai/kankyo/ondanka/kenshu/1016157.html,
131199,,�����s,����,�ȃG�l�Z�~�i�[�u�ƒ�łł���ȃG�l���M�[�̃R�c�v,�V���E�G�l�Z�~�i�[�u�J�e�C�f�f�L���V���E�G�l���M�[�m�R�c�v,,2021/12/8,2021/12/8,14:00,15:00,,,,,,,,,���旧�����}���فi��Ց�4-3-1�j,,,,,,,,2021/11/26,,,/bousai/kankyo/kyodo/1036411.html,
131199,,�����s,����,��R�w���Ӓn��܂��Â���p�l���W�i�ߘa3�N11��25������30���܂ŊJ�×\��j,�I�I���}�G�L�V���E�w���`�N�}�`�d�N���p�l���e���i�����E��3�l��11�c�L25�j�`�J��30�j�`�}�f�J�C�T�C���e�C�j,,2021/11/25,2021/11/30,9:00,17:00,,"��R�w���ӂ̊e�܂��Â��莖�ƂɊւ���p�l�����W���y�W�����e�z	�v���̈ʒu�Â�	�n��v��	�w�O�L�ꐮ�����Ɓi�����X�H��9�����j	�s�X�n�ĊJ������	�s�R�����i���萮���n��i�s�R������j	�s�s�v�擹�H�⏕��26����	�⏕��26�����Ɖ����܂��Â��葊�k�����E�������R�[�f�B�l�[�g	��R�w���n��̂ɂ��킢�̎�g",,,,,,,������k��1�K�C�x���g�X�N�G�A,,,,,,,,,,,/bousai/machidukuri/chiiki/1006312/1035576.html,
131199,,�����s,����,����������i��������X�|�[�c�t�B�[���h�j �ɃL�b�`���J�[���o�X���܂��i�L�b�`���J�[�j,�A�Y�T���R�E�G���i�A�Y�T���X�|�[�c�t�B�[���h�j�j�L�b�`���J�[���V���b�e���V�}�X�i�L�b�`���J�[�j,,2021/11/21,2021/11/21,11:00,16:00,,,,,,,,,,,,,,,,,,,,/bousai/kouen/kouen/1036450.html,
131199,,�����s,����,����������i��������X�|�[�c�t�B�[���h�j �ɃL�b�`���J�[���o�X���܂��i�o�����ǂ��������ߑO�̕��j,�A�Y�T���R�E�G���i�A�Y�T���X�|�[�c�t�B�[���h�j�j�L�b�`���J�[���V���b�e���V�}�X�i�V���b�`���E�R�h���h�E�u�c�G���S�[���m�u�j,,2021/11/21,2021/11/21,10:00,12:00,,,,,,,,,,,,,,,,,,,,/bousai/kouen/kouen/1036450.html,
131199,,�����s,����,����������i��������X�|�[�c�t�B�[���h�j �ɃL�b�`���J�[���o�X���܂��i�o�����ǂ��������ߌ�̕��j,�A�Y�T���R�E�G���i�A�Y�T���X�|�[�c�t�B�[���h�j�j�L�b�`���J�[���V���b�e���V�}�X�i�V���b�`���E�R�h���h�E�u�c�G���S�S�m�u�j,,2021/11/21,2021/11/21,13:30,15:30,,,,,,,,,,,,,,,,,,,,/bousai/kouen/kouen/1036450.html,
131199,,�����s,����,����������i��������X�|�[�c�t�B�[���h�j �ɃL�b�`���J�[���o�X���܂��i�L�b�`���J�[�j,�A�Y�T���R�E�G���i�A�Y�T���X�|�[�c�t�B�[���h�j�j�L�b�`���J�[���V���b�e���V�}�X�i�L�b�`���J�[�j,,2021/11/23,2021/11/23,11:00,16:00,,,,,,,,,,,,,,,,,,,,/bousai/kouen/kouen/1036450.html,
131199,,�����s,����,����������i��������X�|�[�c�t�B�[���h�j �ɃL�b�`���J�[���o�X���܂��i�o�����ǂ��������ߑO�̕��j,�A�Y�T���R�E�G���i�A�Y�T���X�|�[�c�t�B�[���h�j�j�L�b�`���J�[���V���b�e���V�}�X�i�V���b�`���E�R�h���h�E�u�c�G���S�[���m�u�j,,2021/11/23,2021/11/23,10:00,12:00,,,,,,,,,,,,,,,,,,,,/bousai/kouen/kouen/1036450.html,
131199,,�����s,����,����������i��������X�|�[�c�t�B�[���h�j �ɃL�b�`���J�[���o�X���܂��i�o�����ǂ��������ߌ�̕��j,�A�Y�T���R�E�G���i�A�Y�T���X�|�[�c�t�B�[���h�j�j�L�b�`���J�[���V���b�e���V�}�X�i�V���b�`���E�R�h���h�E�u�c�G���S�S�m�u�j,,2021/11/23,2021/11/23,13:30,15:30,,,,,,,,,,,,,,,,,,,,/bousai/kouen/kouen/1036450.html,
131199,,�����s,����,�n�[�u�i�f�B���j���g�������َq�u�K��,�n�[�u�i�f�B���j���c�J�b�^�I�J�V�R�E�V���E�J�C,,2021/11/28,2021/11/28,13:30,14:30,,�n�[�u�i�f�B���j���g�������َq�u�K��,,,,,,,�ԒːA�������@�X�̃A�g���G,,,,,,,,2021/11/24,,,/bousai/kouen/kouen/akatsuka/1035678.html,
131199,,�����s,����,�e�q�Ŕ_�Ƒ̌��i��1��j,�I���R�f�m�E�M���E�^�C�P���i�_�C1�J�C�j,,2021/10/24,2021/10/24,10:00,12:00,,��1��@���܂����̎��n�A���܂����̃c���Ń��[�X���A�ق���񑐂̎�܂�,,,,,,,�ԒːA����[���p�ē��E��ʈē�],,,,,,,,2021/9/10,,,/bousai/kouen/kouen/akatsuka/1034112.html,
131199,,�����s,����,�e�q�Ŕ_�Ƒ̌��i��2��j,�I���R�f�m�E�M���E�^�C�P���i�_�C2�J�C�j,,2021/11/21,2021/11/21,10:00,12:00,,��2��@�ق���񑐂̕c�̐A���t���A���[�X�̏����,,,,,,,�ԒːA����[���p�ē��E��ʈē�],,,,,,,,2021/9/10,,,/bousai/kouen/kouen/akatsuka/1034112.html,
131199,,�����s,����,�e�q�Ŕ_�Ƒ̌��i��3��j,�I���R�f�m�E�M���E�^�C�P���i�_�C3�J�C�j,,2022/1/16,2022/1/16,13:30,16:00,,��3��@�ق���񑐂̎��n�A�H��̌�,,,,,,,�ԒːA����[���p�ē��E��ʈē�],,,,,,,,2021/9/10,,,/bousai/kouen/kouen/akatsuka/1034112.html,
131199,,�����s,����,�ό��A�v���uITA-�}�j�A�v�f�W�^���X�^���v�����[�J�Âɂ���,�J���R�E�A�v���uITA-�}�j�A�v�f�W�^���X�^���v�����[�J�C�T�C�j�c�C�e,,2021/10/25,2022/3/21,,,,"	�{�y�[�W�����ɂ���񎟌��R�[�h����A�ό��A�v���uITA-�}�j�A�v���_�E�����[�h���Ă��������B	�J�Ê��Ԓ��ɃX�^���v�ݒu�{�݁i���16�{�݁j���܂��A�f�W�^���X�^���v���W�߂Ă��������B�i�f�W�^���X�^���v�́A�e�{�݂ɐݒu���Ă���񎟌��R�[�h���A�v�����N�����ēǂݍ��ނ��ƂŏW�߂邱�Ƃ��o���܂��B�j	�f�W�^���X�^���v����萔�W�߂�ƁA���I�őf�G�ȏܕi��������܂��B�i�X�^���v2��1���ډ���A�X�^���v4��2���ډ���A�X�^���v6��3���ډ���\�ł��B�ő�3������\�B�ܕi�͂��I�тł��܂���̂ŗ\�߂��������������B�j	�R���v���[�g�܂Ƃ��āA���ׂĂ̎{�݁i16�{�݁j�̃X�^���v���W�߂����撅200���l�ɑf�G�ȃv���[���g��p�ӂ��Ă��܂��B�R���v���[�g�܂́A�����΂��ό��Z���^�[�ł��n�����܂��B",,,,,,,�X�^���v�ݒu�{�݁i��������{�ݓ�16�{�݁j�A���L�O����X�|�[�c�Z���^�[�i�������̈�فj�i����1-10-5�j�����΂��ό��Z���^�[�i��3-14-15�j�����ǂ��������i��3-50-1�@�����������j�ܕēX�i���h40-1�j������̈�فi������3-1-1�j�G�R�|���X�Z���^�[�i�O�쒬4-6-1�j����̈�فi����1-3-1�j�����}���فi��Ց�4-3-1�j����Ȋw�فi��Ց�4-14-1�j���p�فi�Ԓ�5-34-27�j�Ԓˑ̈�فi�Ԓ�5-6-1�j�ԒːA�����i�Ԓ�5-17-14�j���y�����فi�Ԓ�5-35-25�j�����������v�[���i������8-28-1�j�M�ъ��A���فi������8-29-2�j���ǂ��������E�����������i������8-24-1���ۃP���������j�E�ꏊ�̏ڍׂ��ẮA�ǂ��i�r�����΂��i�O�������N�j�ł��m�F���������B,,,,,,,,,,,/kusei/profile/kanko/joho/1026826.html,
131199,,�����s,����,�I�����C�����Y�W�u���Y���z��́I�S�����܂����̃}���V�F in �����΂��v,�I�����C���u�b�T���e���u�X�M�E���^�C���E�V���V�m�I�[���R�N�E�}�C���m�}���V�Fin�C�^�o�V�v,,2021/11/1,2022/1/31,,,,����ό���g ���Y���z���� ���S�͂ł������߂���A�𗬎����̂₢���΂��̖��͓I�ȃO�����g�S���̂��܂����́h����݃T�C�g�Ŕ̔����܂��B������C�̍K�A�Â����̂ȂǗl�X�ȃW����������A�o�X�҂����M�������Ă��͂����邤�܂����̂͂ǂ���G��I�I���񂾂��̓��ʃZ�b�g���ڔ������ł��B�S���̂��܂����̂������񂹂��đf�G�Ȃ��������Ԃ����߂������������c�ڍ׏��́A���L�����N�̓��݃T�C�g�ł��m�F���������B,,,,,,,�C�x���g����Web�T�C�g,,,,,,,,,,,/kusei/profile/event/1036331.html,
131199,,�����s,����,���Y�W�u���斯�ӂ邳�ƃ}���V�F�v,�u�b�T���e���u�C�^�o�V�N�~���t���T�g�}���V�F�v,,2021/11/11,2021/11/13,11:00,16:00,,��������~�}���V�F�J�ÁI���̈ꉟ���O�������W�܂�u���斯�ӂ邳�ƃ}���V�F�v���������O�ŊJ�Â��܂��B�h���}�Řb��̏a��h��䂩��̎����̂���W���I���̐l�C�X�C�[�c�g�}���g�b�c�H�h��L�b�V���A�k�C���\���̃`�[�Y�A���т̂����Ɂg�������̂��y�؁h�Ȃǔ���������i�����肾������I�I�o�X�҂Ȃǂ̏ڍ׏��́AItabashi-marche.com�@�ł��m�F���������B�y�j���́A�����΂��ό��L�����N�^�[����񂿂��ƁA�[�J�s�̂��L�����A�ӂ����������V�тɗ��܂��B&nbsp;�����J�Ïa��h��v��90���N���L�O���āA�����1�K�搭���ۑO�v�����[�V�����R�[�i�[�ɂďa��h��̃p�l���W���s���܂��B�܂��A11��11���i�h�ꉥ�̖����j�̂݁A���X�y�[�X�ɋL�O�L�����ݒu���܂��B&nbsp;���ꕔ�L���b�V�����X���ςɑΉ����Ă��܂��B��������ʏ��i���i�v���~�A���t���܂ށj�ɑΉ����Ă��܂��B�����̃C�x���g�̓e�C�N�A�E�g�̔��݂̂ł��B���n�ł̈��H�͂ł��܂���B������������X�g�����uCAFE DINING NAKAJUKU]�ŁA���̃C�x���g�ɍ��킹�Č𗬎����̂̂����n���j���[�����Ԍ���Œ񋟂��Ă��܂��B���ꂳ�ꂽ�F�l�A���񂨏����オ�肭�������B,,,,,,,��������{���ɐ��ʃ��[�^���[�E�����M�p���ɘe��L�n,,,,,,,,,,,/kusei/profile/event/1036338.html,
131199,,�����s,����,���n��Łu�斯�Ƌ撷�Ƃ̍��k��v���J�Â��܂�,�C�^�o�V�`�N�f�u�N�~���g�N�`���E�g�m�R���_���J�C�v���J�C�T�C�V�}�X,,2021/11/17,2021/11/17,14:00,15:00,,�n��̉ۑ�₱�ꂩ��̋搭�ɂ��Ă̈ӌ�����,,,,,,,���n��Z���^�[[���n��Z���^�[�E�Ǔ��W�],,,,,,,,,,,/kusei/publiccomment/kondankai/1034539.html,
131199,,�����s,����,�푈�̋L���̌p��,�Z���\�E�m�L�I�N�m�P�C�V���E,,2021/11/27,2021/11/27,13:30,15:30,,�����ɐ��܂�푈�̎�����o�Đ������������b�Z�[�W�Ƃ͉���&nbsp;�u�푈�̂炢�̌���������x�ƌJ��Ԃ����Ƃ̂Ȃ��悤�ɁA��҂ɉ���b����̂��낤���B�v���������������͒����Ő��܂�I����}���A�A�����Ă��Ȃ��������󋵂ɂ������Ƃ����B���{�̗��j�I�ɂ��M�d�Ȏ��Ԃ�m�錾�t�Ɏ����X���Ă݂悤�B&nbsp;���������e�̏d�v���ɂ��Ċw�|���ɂ��R�����g������܂��B,,,,,,,�匴���U�w�K�Z���^�[�i�܂Ȃہ[�Ƒ匴�j,,,,,,,,,,,/kyoikuiinkai/shogai/manaport/ohara/1035357.html,
131199,,�����s,����,�y�����}���فz����Ă݂悤�I�@�ǂ��Ԃ��傤���@2022�N1��9��,�y�q�K�V�C�^�o�V�g�V���J���z���b�e�~���E�I�@�h�E�u�c�V�傤���@2022�l��1�c�L9�j�`,,2022/1/9,2022/1/9,13:30,14:30,,�u�ǂ��Ԃ��傤���v�̗V�ѕ��̃��N�`���[�ƃQ�[���̌�,,,,,,,�����}���ف@�����o��,,,,,,,,,,,/kosodate/1000930/etc/1036247.html,
131199,,�����s,����,�y�����}���فz����Ă݂悤�I�@�ǂ��Ԃ��傤���@2022�N1��9��,�y�q�K�V�C�^�o�V�g�V���J���z���b�e�~���E�I�@�h�E�u�c�V�傤���@2022�l��1�c�L9�j�`,,2022/1/9,2022/1/9,15:00,16:00,,�u�ǂ��Ԃ��傤���v�̗V�ѕ��̃��N�`���[�ƃQ�[���̌�,,,,,,,�����}���ف@�����o��,,,,,,,,,,,/kosodate/1000930/etc/1036247.html,
131199,,�����s,����,�y�����}���فz�H�̂��͂Ȃ���,�y�`���E�I�E�g�V���J���z�A�L�m�I�n�i�V�J�C,,2021/10/30,2021/10/30,10:30,11:15,,�n���E�B���₨�΂��̂��͂Ȃ����W�߂܂����I��������܍����s���܂��B,,,,,,,�����}���ف@�}���كz�[��B,,,,,,,,,,,/kosodate/1000930/etc/1035492.html,
131199,,�����s,����,�y�X��}���فz���ł����낭�@2021�N10��27������11��29���܂�,�y�q�J���g�V���J���z�����f�X�S���N�@2021�l��10�c�L27�j�`�J��11�c�L29�j�`�}�f,,2021/10/27,2021/11/29,,,,�{���؂�āA�����낭�ɒ���I,,,,,,,�X��}����,,,,,,,,,,,/kosodate/1000930/etc/1035370.html,
131199,,�����s,����,���O��ۈ牀�@�����̌��w�ɂ��� ��ꕔ,�j�V�}�G�m�z�C�N�G���@�G���i�C�m�P���K�N�j�c�C�e�_�C�C�`�u,,2021/11/17,2021/11/17,9:45,11:15,,,,,,,,,,,,,,,,,,,,/kosodate/azukeru/ninka/annai/hoikuen/nishimaeno/1015594/1035375.html,
131199,,�����s,����,���O��ۈ牀�@�����̌��w�ɂ��ā@���,�j�V�}�G�m�z�C�N�G���@�G���i�C�m�P���K�N�j�c�C�e�@�_�C�j�u,,2021/11/17,2021/11/17,10:15,10:45,,,,,,,,,,,,,,,,,,,,/kosodate/azukeru/ninka/annai/hoikuen/nishimaeno/1015594/1035375.html,
131199,,�����s,����,���O��ۈ牀�@�����̌��w�ɂ��ā@��O��,�j�V�}�G�m�z�C�N�G���@�G���i�C�m�P���K�N�j�c�C�e�@�_�C�T���u,,2021/11/17,2021/11/17,10:45,11:15,,,,,,,,,,,,,,,,,,,,/kosodate/azukeru/ninka/annai/hoikuen/nishimaeno/1015594/1035375.html,
131199,,�����s,����,�y�X��}���فz�n���h�x���R���T�[�g�@2021�N12��19��,�y�q�J���g�V���J���z�n���h�x���R���T�[�g�@2021�l��12�c�L19�j�`,,2021/12/19,2021/12/19,14:00,15:00,,�{�����e�B�A�O���[�vSV���ɂ�鉉�t,,,,,,,�X��}���ف@�����o��,,,,,,,,,,,/bunka/bunka/1019950/1020073/1036251.html,
131199,,�����s,����,�y�X��}���فz�n���h�x���R���T�[�g�@2021�N12��19��,�y�q�J���g�V���J���z�n���h�x���R���T�[�g�@2021�l��12�c�L19�j�`,,,,,,,�{�����e�B�A�O���[�vSV���ɂ�鉉�t,,,,,,,�X��}���ف@�����o��,,,,,,,,,,,/bunka/bunka/1019950/1020073/1036251.html,
131199,,�����s,����,�y���΍��}���فz���p�j�u���i�t�F�����[���j�@2021�N12��12��,�y�R���l�g�V���J���z�r�W���c�V�R�E�U�i�t�F�����[���j�@2021�l��12�c�L12�j�`,,2021/12/12,2021/12/12,10:30,12:00,,�u�`�u�t�F�����[���̋��Ӑ��A����Ƃ������̌�T�v,,,,,,,���΍��}���ف@�����o��,,,,,,,,,,,/bunka/bunka/1019950/1020073/1035606.html,
131199,,�����s,����,�y���΍��}���فz���p�j�u���i�t�F�����[���j�@2021�N12��12��,�y�R���l�g�V���J���z�r�W���c�V�R�E�U�i�t�F�����[���j�@2021�l��12�c�L12�j�`,,,,,,,�u�`�u�t�F�����[���̋��Ӑ��A����Ƃ������̌�T�v,,,,,,,���΍��}���ف@�����o��,,,,,,,,,,,/bunka/bunka/1019950/1020073/1035606.html,
131199,,�����s,����,�y�����}���فz�I���W�i�����󒠂����낤�I�@2021�N12��11��,�y�i���}�X�g�V���J���z�I���W�i���S�V���C���`���E���c�N���E�I�@2021�l��12�c�L11�j�`,,2021/12/11,2021/12/11,14:00,15:30,,����ނ̐F���̒�����D���ȕ���I��Ŏ��������̃I���W�i�����󒠂����܂��B,,,,,,,�����A�[�g�M�������[,,,,,,,,,,,/bunka/bunka/1019950/1020073/1036270.html,
131199,,�����s,����,�y�����}���فz�I���W�i�����󒠂����낤�I�@2021�N12��11��,�y�i���}�X�g�V���J���z�I���W�i���S�V���C���`���E���c�N���E�I�@2021�l��12�c�L11�j�`,,,,,,,����ނ̐F���̒�����D���ȕ���I��Ŏ��������̃I���W�i�����󒠂����܂��B,,,,,,,�����A�[�g�M�������[,,,,,,,,,,,/bunka/bunka/1019950/1020073/1036270.html,
131199,,�����s,����,�y���΍��}���فz�G�h���[�h�E�S�[���[�̂����ȓ��j���@2021�N12��5��,�y�R���l�g�V���J���z�G�h���[�h�E�S�[���[�m�E�����i�j�`���E�r�@2021�l��12�c�L5�j�`,,2021/12/5,2021/12/5,14:00,15:00,,��ƁE�G�h���[�h�E�S�[���[�ɂ��Ă̍u�`,,,,,,,���΍��}���ف@�����o��,,,,,,,,,,,/bunka/bunka/1019950/1020073/1036250.html,
131199,,�����s,����,�y���΍��}���فz�G�h���[�h�E�S�[���[�̂����ȓ��j���@2021�N12��5��,�y�R���l�g�V���J���z�G�h���[�h�E�S�[���[�m�E�����i�j�`���E�r�@2021�l��12�c�L5�j�`,,,,,,,��ƁE�G�h���[�h�E�S�[���[�ɂ��Ă̍u�`,,,,,,,���΍��}���ف@�����o��,,,,,,,,,,,/bunka/bunka/1019950/1020073/1036250.html,
131199,,�����s,����,�y�Ԓː}���فz���w�u���u���΁@���؏W�i�A���\���W�[�j�v�@2021�N12��5��,�y�A�J�c�J�g�V���J���z�u���K�N�R�E�U�u�\�E�Z�L�@�V�J�V���E�i�A���\���W�[�j�v�@2021�l��12�c�L5�j�`,,2021/12/5,2021/12/5,10:00,12:00,,�Ėڟ��΂ɂ��Ă̍u�`,,,,,,,���Ԓ˒n��Z���^�[,,,,,,,,,,,/bunka/bunka/1019950/1020073/1036249.html,